eagle-n
type: LexicalEntry
canonical form: eagle
sense: 01615935-n
part of speech: noun

bird of Jove-n
type: LexicalEntry
canonical form: bird of Jove
sense: 01615935-n
part of speech: noun

01615935-n
type: LexicalConcept
in scheme: en-word.net
definition: any of various large keen-sighted diurnal birds of prey noted for their broad wings and strong soaring flight
ili: i43785
lexfile: noun.animal
part of speech: noun
hypernym: 01606971-n