hobby-n
type: LexicalEntry
canonical form: hobby
sense: 01615117-n
part of speech: noun

Falco subbuteo-n
type: LexicalEntry
canonical form: Falco subbuteo
sense: 01615117-n
part of speech: noun

01615117-n
type: LexicalConcept
in scheme: en-word.net
definition: small Old World falcon formerly trained and flown at small birds
ili: i43780
lexfile: noun.animal
part of speech: noun
hypernym: 01613596-n