kinky-a
type: LexicalEntry
canonical form: kinky
sense: 01602091-s
part of speech: adjective

perverted-a
type: LexicalEntry
canonical form: perverted
sense: 01602091-s
part of speech: adjective

01602091-s
type: LexicalConcept
in scheme: en-word.net
definition: (used of sexual behavior) showing or appealing to bizarre or deviant tastes
example: kinky sex
example: perverted practices
ili: i8740
lexfile: adj.all
part of speech: adjective satellite
similar: https://en-word.net/synset/01600178-a