modal-a
type: LexicalEntry
canonical form: modal
sense: 01599393-s
part of speech: adjective

average-a
type: LexicalEntry
canonical form: average
sense: 01599393-s
part of speech: adjective

01599393-s
type: LexicalConcept
in scheme: en-word.net
definition: relating to or constituting the most frequent value in a distribution
example: the modal age at which American novelists reach their peak is 30
ili: i8728
lexfile: adj.all
part of speech: adjective satellite
domain topic: 06027814-n
similar: https://en-word.net/synset/01598231-a