median-a
type: LexicalEntry
canonical form: median
sense: 01599054-s
part of speech: adjective

average-a
type: LexicalEntry
canonical form: average
sense: 01599054-s
part of speech: adjective

01599054-s
type: LexicalConcept
in scheme: en-word.net
definition: relating to or constituting the middle value of an ordered set of values (or the average of the middle two in a set with an even number of values)
example: the median value of 17, 20, and 36 is 20
example: the median income for the year was $15,000
ili: i8727
lexfile: adj.all
part of speech: adjective satellite
domain topic: 06027814-n
similar: https://en-word.net/synset/01598231-a