swallow-n
type: LexicalEntry
canonical form: swallow
sense: 01597013-n
part of speech: noun

01597013-n
type: LexicalConcept
in scheme: en-word.net
definition: small long-winged songbird noted for swift graceful flight and the regularity of its migrations
ili: i43677
lexfile: noun.animal
part of speech: noun
hypernym: 01528361-n