ladle-v
type: LexicalEntry
canonical form: ladle
sense: 01581842-v
part of speech: verb

01581842-v
type: LexicalConcept
in scheme: en-word.net
definition: put (a liquid) into a container by means of a ladle
example: ladle soup into the bowl
ili: i29621
lexfile: verb.contact
part of speech: verb
hypernym: 01496967-v