grate-v
type: LexicalEntry
canonical form: grate
sense: 01576908-v
part of speech: verb

01576908-v
type: LexicalConcept
in scheme: en-word.net
definition: reduce to small shreds or pulverize by rubbing against a rough or sharp perforated surface
example: grate carrots and onions
example: grate nutmeg
ili: i29598
lexfile: verb.contact
part of speech: verb
hypernym: 01252288-v