plant-v
type: LexicalEntry
canonical form: plant
sense: 01570056-v
part of speech: verb

set-v
type: LexicalEntry
canonical form: set
sense: 01570056-v
part of speech: verb

01570056-v
type: LexicalConcept
in scheme: en-word.net
definition: put or set (seeds, seedlings, or plants) into the ground
example: Let's plant flowers in the garden
ili: i29566
lexfile: verb.contact
part of speech: verb
hypernym: 01496967-v