little-a
type: LexicalEntry
canonical form: little
sense: https://en-word.net/lemma/little-a#01558903-a
part of speech: adjective

slight-a
type: LexicalEntry
canonical form: slight
sense: https://en-word.net/lemma/slight-a#01558903-a
part of speech: adjective

https://en-word.net/synset/01558903-a
type: LexicalConcept
in scheme: en-word.net
definition: (quantifier used with mass nouns) small in quantity or degree; not much or almost none or (with ‘a’) at least some
example: little rain fell in May
example: gave it little thought
example: little time is left
example: we still have little money
example: a little hope remained
example: there's slight chance that it will work
example: there's a slight chance it will work
ili: i8534
lexfile: adj.all
part of speech: adjective
also: https://en-word.net/synset/01559809-a
similar: 01559333-s