incorporate-v
type: LexicalEntry
canonical form: incorporate
sense: 01543782-v
part of speech: verb

01543782-v
type: LexicalConcept
in scheme: en-word.net
definition: unite or merge with something already in existence
example: incorporate this document with those pertaining to the same case
ili: i29437
lexfile: verb.contact
part of speech: verb
hypernym: 01217350-v