impress-v
type: LexicalEntry
canonical form: impress
sense: 01534530-v
part of speech: verb

imprint-v
type: LexicalEntry
canonical form: imprint
sense: 01534530-v
part of speech: verb

01534530-v
type: LexicalConcept
in scheme: en-word.net
definition: mark or stamp with or as if with pressure
example: To make a batik, you impress a design with wax
ili: i29391
lexfile: verb.contact
part of speech: verb
entails: 01449876-v
hypernym: 00356912-v