set-v
type: LexicalEntry
canonical form: set
sense: 01533061-v
part of speech: verb

countersink-v
type: LexicalEntry
canonical form: countersink
sense: 01533061-v
part of speech: verb

01533061-v
type: LexicalConcept
in scheme: en-word.net
definition: insert (a nail or screw below the surface, as into a countersink)
ili: i29382
lexfile: verb.contact
part of speech: verb
hypernym: 01532886-v