tempered-a
type: LexicalEntry
canonical form: tempered
sense: https://en-word.net/lemma/tempered-a#01525258-a
part of speech: adjective

https://en-word.net/synset/01525258-a
type: LexicalConcept
in scheme: en-word.net
definition: adjusted or attuned by adding a counterbalancing element
example: criticism tempered with kindly sympathy
ili: i8348
lexfile: adj.all
part of speech: adjective