twine-v
type: LexicalEntry
canonical form: twine
sense: 01520680-v
part of speech: verb

01520680-v
type: LexicalConcept
in scheme: en-word.net
definition: make by twisting together or intertwining
example: twine a rope
ili: i29315
lexfile: verb.contact
part of speech: verb
hypernym: 01620211-v
similar: 01520294-v