boost-v
type: LexicalEntry
canonical form: boost
sense: 01518703-v
part of speech: verb

01518703-v
type: LexicalConcept
in scheme: en-word.net
definition: push or shove upward, as if from below or behind
example: The singer had to be boosted onto the stage by a special contraption
ili: i29305
lexfile: verb.contact
part of speech: verb
hypernym: 01903255-v