violent-a
type: LexicalEntry
canonical form: violent
sense: 01518224-s
part of speech: adjective

wild-a
type: LexicalEntry
canonical form: wild
sense: 01518224-s
part of speech: adjective

01518224-s
type: LexicalConcept
in scheme: en-word.net
definition: (of colors or sounds) intensely vivid or loud
example: a violent clash of colors
example: her dress was a violent red
example: a violent noise
example: wild colors
example: wild shouts
ili: i8312
lexfile: adj.all
part of speech: adjective satellite
similar: https://en-word.net/synset/01513206-a