shitless-a
type: LexicalEntry
canonical form: shitless
sense: 01517273-s
part of speech: adjective

witless-a
type: LexicalEntry
canonical form: witless
sense: 01517273-s
part of speech: adjective

01517273-s
type: LexicalConcept
in scheme: en-word.net
definition: (used as complement) to the utmost degree
example: he was scared witless
example: the students were bored shitless
lexfile: adj.all
part of speech: adjective satellite
similar: https://en-word.net/synset/01513206-a