scuffle-v
type: LexicalEntry
canonical form: scuffle
sense: 01507112-v
part of speech: verb

tussle-v
type: LexicalEntry
canonical form: tussle
sense: 01507112-v
part of speech: verb

01507112-v
type: LexicalConcept
in scheme: en-word.net
definition: fight or struggle in a confused way at close quarters
example: the drunken men started to scuffle
ili: i29248
lexfile: verb.contact
part of speech: verb
hypernym: 01092746-v