shanghai-v
type: LexicalEntry
canonical form: shanghai
sense: 01474177-v
part of speech: verb

impress-v
type: LexicalEntry
canonical form: impress
sense: 01474177-v
part of speech: verb

01474177-v
type: LexicalConcept
in scheme: en-word.net
definition: take (someone) against their will for compulsory service, especially on board a ship
example: The men were shanghaied after being drugged
ili: i29076
lexfile: verb.contact
part of speech: verb
domain topic: 00767761-n
hypernym: 01473673-v