stray-a
type: LexicalEntry
canonical form: stray
sense: 01453222-s
part of speech: adjective

01453222-s
type: LexicalConcept
in scheme: en-word.net
definition: (of an animal) having no home or having wandered away from home
example: a stray calf
example: a stray dog
ili: i7929
lexfile: adj.all
part of speech: adjective satellite
similar: https://en-word.net/synset/01452455-a