spud-v
type: LexicalEntry
canonical form: spud
sense: 01446109-v
part of speech: verb

01446109-v
type: LexicalConcept
in scheme: en-word.net
definition: initiate drilling operations, as for petroleum
example: The well was spudded in April
ili: i28942
lexfile: verb.contact
part of speech: verb
hypernym: 01445640-v