punch-v
type: LexicalEntry
canonical form: punch
sense: 01445398-v
part of speech: verb

perforate-v
type: LexicalEntry
canonical form: perforate
sense: 01445398-v
part of speech: verb

01445398-v
type: LexicalConcept
in scheme: en-word.net
definition: make a hole into or between, as for ease of separation
example: perforate the sheets of paper
ili: i28940
lexfile: verb.contact
part of speech: verb
hypernym: 01443719-v