short-a
type: LexicalEntry
canonical form: short
sense: https://en-word.net/lemma/short-a#01445077-a
part of speech: adjective

https://en-word.net/synset/01445077-a
type: LexicalConcept
in scheme: en-word.net
definition: primarily temporal sense; indicating or being or seeming to be limited in duration
example: a short life
example: a short flight
example: a short holiday
example: a short story
example: only a few short months
ili: i7884
lexfile: adj.all
part of speech: adjective
also: https://en-word.net/synset/00004412-a
attribute: 05058400-n
similar: 01445488-s
similar: 01445717-s
similar: 01445865-s
similar: 01445988-s
similar: 01446293-s
similar: 01446472-s
similar: 01446624-s
similar: 01446733-s