stick-v
type: LexicalEntry
canonical form: stick
sense: 01444412-v
part of speech: verb

01444412-v
type: LexicalConcept
in scheme: en-word.net
definition: pierce or penetrate or puncture with something pointed
example: He stuck the needle into his finger
ili: i28935
lexfile: verb.contact
part of speech: verb
hypernym: 01444129-v
similar: 01444612-v