send-v
type: LexicalEntry
canonical form: send
sense: 01439891-v
part of speech: verb

send out-v
type: LexicalEntry
canonical form: send out
sense: 01439891-v
part of speech: verb

01439891-v
type: LexicalConcept
in scheme: en-word.net
definition: to cause or order to be taken, directed, or transmitted to another place
example: He had sent the dispatches downtown to the proper people and had slept
ili: i28915
lexfile: verb.contact
part of speech: verb
hypernym: 01438013-v