retrieve-v
type: LexicalEntry
canonical form: retrieve
sense: 01436442-v
part of speech: verb

01436442-v
type: LexicalConcept
in scheme: en-word.net
definition: run after, pick up, and bring to the master
example: train the dog to retrieve
ili: i28897
lexfile: verb.contact
part of speech: verb
hypernym: 01435927-v
similar: 01436624-v