absurd-a
type: LexicalEntry
canonical form: absurd
sense: 01433985-s
part of speech: adjective

01433985-s
type: LexicalConcept
in scheme: en-word.net
definition: inconsistent with reason or logic or common sense
example: the absurd predicament of seeming to argue that virtue is highly desirable but intensely unpleasant
  source: Walter Lippman
ili: i7818
lexfile: adj.all
part of speech: adjective satellite
similar: https://en-word.net/synset/01433720-a