swing-v
type: LexicalEntry
canonical form: swing
sense: 01430116-v
part of speech: verb

01430116-v
type: LexicalConcept
in scheme: en-word.net
definition: engage freely in promiscuous sex, often with the husband or wife of one's friends
example: There were many swinging couples in the 1960's
ili: i28866
lexfile: verb.contact
part of speech: verb
hypernym: 01429911-v