cuddle-v
type: LexicalEntry
canonical form: cuddle
sense: 01428162-v
part of speech: verb

01428162-v
type: LexicalConcept
in scheme: en-word.net
definition: hold (a person or thing) close, as for affection, comfort, or warmth
example: I cuddled the baby
ili: i28858
lexfile: verb.contact
part of speech: verb
hypernym: 01427110-v