unplug-v
type: LexicalEntry
canonical form: unplug
sense: 01424071-v
part of speech: verb

disconnect-v
type: LexicalEntry
canonical form: disconnect
sense: 01424071-v
part of speech: verb

01424071-v
type: LexicalConcept
in scheme: en-word.net
definition: pull the plug of (electrical appliances) and render inoperable
example: unplug the hair dryer after using it
ili: i28838
lexfile: verb.contact
part of speech: verb
hypernym: 01522610-v