slap-v
type: LexicalEntry
canonical form: slap
sense: 01419525-v
part of speech: verb

01419525-v
type: LexicalConcept
in scheme: en-word.net
definition: hit with something flat, like a paddle or the open hand
example: The impatient teacher slapped the student
example: a gunshot slapped him on the forehead
ili: i28812
lexfile: verb.contact
part of speech: verb
hypernym: 01412877-v