sponge-v
type: LexicalEntry
canonical form: sponge
sense: 01395317-v
part of speech: verb

01395317-v
type: LexicalConcept
in scheme: en-word.net
definition: wipe with a sponge, so as to clean or moisten
ili: i28680
lexfile: verb.contact
part of speech: verb
hypernym: 01394891-v