strew-v
type: LexicalEntry
canonical form: strew
sense: 01380788-v
part of speech: verb

straw-v
type: LexicalEntry
canonical form: straw
sense: 01380788-v
part of speech: verb

01380788-v
type: LexicalConcept
in scheme: en-word.net
definition: spread by scattering (‘straw’ is archaic)
example: strew toys all over the carpet
ili: i28599
lexfile: verb.contact
part of speech: verb
hypernym: 01381221-v