transcendent-a
type: LexicalEntry
canonical form: transcendent
sense: 01377838-s
part of speech: adjective

01377838-s
type: LexicalConcept
in scheme: en-word.net
definition: beyond and outside the ordinary range of human experience or understanding
example: the notion of any transcendent reality beyond thought
ili: i7490
lexfile: adj.all
part of speech: adjective satellite
similar: https://en-word.net/synset/01377715-a