vector-n
type: LexicalEntry
canonical form: vector
sense: 01374679-n
part of speech: noun

01374679-n
type: LexicalConcept
in scheme: en-word.net
definition: (genetics) a virus or other agent that is used to deliver DNA to a cell
ili: i42532
lexfile: noun.animal
part of speech: noun
domain topic: 06085077-n
hypernym: 01331343-n