funereal-a
type: LexicalEntry
canonical form: funereal
sense: 01371380-s
part of speech: adjective

sepulchral-a
type: LexicalEntry
canonical form: sepulchral
sense: 01371380-s
part of speech: adjective

01371380-s
type: LexicalConcept
in scheme: en-word.net
definition: suited to or suggestive of a grave or burial
example: funereal gloom
example: hollow sepulchral tones
ili: i7453
lexfile: adj.all
part of speech: adjective satellite
similar: https://en-word.net/synset/01371108-a