gum-v
type: LexicalEntry
canonical form: gum
sense: 01366722-v
part of speech: verb

01366722-v
type: LexicalConcept
in scheme: en-word.net
definition: cover, fill, fix or smear with or as if with gum
example: if you gum the tape it is stronger
ili: i28520
lexfile: verb.contact
part of speech: verb
hypernym: 01366351-v