string-v
type: LexicalEntry
canonical form: string
sense: 01363126-v
part of speech: verb

01363126-v
type: LexicalConcept
in scheme: en-word.net
definition: string together; tie or fasten with a string
example: string the package
ili: i28500
lexfile: verb.contact
part of speech: verb
hypernym: 01343121-v