nail-v
type: LexicalEntry
canonical form: nail
sense: 01360534-v
part of speech: verb

01360534-v
type: LexicalConcept
in scheme: en-word.net
definition: attach something somewhere by means of nails
example: nail the board onto the wall
ili: i28484
lexfile: verb.contact
part of speech: verb
hypernym: 01299048-v