interconnect-v
type: LexicalEntry
canonical form: interconnect
sense: 01358349-v
part of speech: verb

interlink-v
type: LexicalEntry
canonical form: interlink
sense: 01358349-v
part of speech: verb

01358349-v
type: LexicalConcept
in scheme: en-word.net
definition: cause to be interconnected or interwoven
ili: i28472
lexfile: verb.contact
part of speech: verb
hypernym: 01357376-v