take out-v
type: LexicalEntry
canonical form: take out
sense: 01355093-v
part of speech: verb

01355093-v
type: LexicalConcept
in scheme: en-word.net
definition: remove something from a container or an enclosed space
ili: i28454
lexfile: verb.contact
part of speech: verb
hypernym: 00173351-v