attract-v
type: LexicalEntry
canonical form: attract
sense: 01352707-v
part of speech: verb

01352707-v
type: LexicalConcept
in scheme: en-word.net
definition: exert a force on (a body) causing it to approach or prevent it from moving away
example: the gravitational pull of a planet attracts other bodies
ili: i28443
lexfile: verb.contact
part of speech: verb
hypernym: 01612191-v