virus-n
type: LexicalEntry
canonical form: virus
sense: 01331343-n
part of speech: noun

01331343-n
type: LexicalConcept
in scheme: en-word.net
definition: (virology) ultramicroscopic infectious agent that replicates itself only within cells of living hosts; many are pathogenic; a piece of nucleic acid (DNA or RNA) wrapped in a thin coat of protein
ili: i42336
lexfile: noun.animal
part of speech: noun
domain topic: 06075190-n
hypernym: 01328932-n
hypernym: 09335749-n