exterminate-v
type: LexicalEntry
canonical form: exterminate
sense: 01330264-v
part of speech: verb

kill off-v
type: LexicalEntry
canonical form: kill off
sense: 01330264-v
part of speech: verb

01330264-v
type: LexicalConcept
in scheme: en-word.net
definition: kill en masse; kill on a large scale; kill many
example: Hitler wanted to exterminate the Jews, Gypsies, Communists, and homosexuals of Europe
ili: i28322
lexfile: verb.contact
part of speech: verb
hypernym: 01326622-v