isolated-a
type: LexicalEntry
canonical form: isolated
sense: 01330157-s
part of speech: adjective

quarantined-a
type: LexicalEntry
canonical form: quarantined
sense: 01330157-s
part of speech: adjective

01330157-s
type: LexicalConcept
in scheme: en-word.net
definition: under forced isolation especially for health reasons
example: a quarantined animal
example: isolated patients
ili: i7236
lexfile: adj.all
part of speech: adjective satellite
similar: https://en-word.net/synset/01329869-a