kill-v
type: LexicalEntry
canonical form: kill
sense: 01326622-v
part of speech: verb

01326622-v
type: LexicalConcept
in scheme: en-word.net
definition: cause to die; put to death, usually intentionally or knowingly
example: This man killed several people when he tried to rob a bank
example: The farmer killed a pig for the holidays
ili: i28306
lexfile: verb.contact
part of speech: verb
causes: 00359085-v
exemplifies: 06730109-n
hypernym: 00126072-v
similar: 01328218-v