frisk-v
type: LexicalEntry
canonical form: frisk
sense: 01320883-v
part of speech: verb

01320883-v
type: LexicalConcept
in scheme: en-word.net
definition: search as for concealed weapons by running the hands rapidly over the clothing and through the pockets
example: The police frisked everyone at the airport
ili: i28275
lexfile: verb.contact
part of speech: verb
hypernym: 01320383-v