plane-v
type: LexicalEntry
canonical form: plane
sense: 01310049-v
part of speech: verb

01310049-v
type: LexicalConcept
in scheme: en-word.net
definition: make even or smooth, with or as with a carpenter's plane
example: plane the top of the door
ili: i28221
lexfile: verb.contact
part of speech: verb
hypernym: 01255535-v