austere-a
type: LexicalEntry
canonical form: austere
sense: 01303135-s
part of speech: adjective

stern-a
type: LexicalEntry
canonical form: stern
sense: 01303135-s
part of speech: adjective

01303135-s
type: LexicalConcept
in scheme: en-word.net
definition: of a stern or strict bearing or demeanor; forbidding in aspect
example: an austere expression
example: a stern face
ili: i7084
lexfile: adj.all
part of speech: adjective satellite
similar: https://en-word.net/synset/01302836-a